Quantcast








     

passwordlib fatal error

stackoverflow.com - 2013-03-24 08:48:09 - Similar - Report/Block

I'm using PasswordLib . I run my project on wamp and everything is OK but when I uploaded it to my hosting I got this error: Fatal error: Uncaught exception 'PharException' with message '__HALT_COMPILER(); must be declared in a phar' in /data/web/virtuals/9784/virtual/www/subd om/roids/_libs/PasswordLib.phar:21 Stack trace: #0 /data/web/vi...

Codeigniter Active Records Fatal Error

stackoverflow.com - 2012-03-06 05:45:12 - Similar - Report/Block

new to stack overflow (and codeigniter!) and I'm running into this issue on my first project, naturally... I'm sure its a bonehead error on my part, but I've been researching and trying to figure it out for the last few hours and I cat seem to figure it out... I have the database library autoloaded, but everytime I try to use the methods...

Fatal error: Interface 'Twig_LoaderInterface' not found in AbsoluteFilesystem.php on line 10

stackoverflow.com - 2012-11-03 08:56:34 - Similar - Report/Block

I am using WAMP server on windows 7 and zend framework 2. I used module ZfcTwig to configure Twig template engine, but i am getting this error: ( ! ) Fatal error: Interface 'Twig_LoaderInterface' not found in D:\wamp\www\mysocial\libs\ZfcTwig\src\Zf cTwig\Twig\Loader\AbsoluteFilesystem.php on line 10 Call Stack # Time Memory Function Loc...

Suppress user-visible PHP error messages but not error log messages

stackoverflow.com - 2012-03-15 17:53:05 - Similar - Report/Block

I'd like for PHP to still send it's minor and fatal errors to the error log but not display it to the user. I thought at first I could use error_reporting(0); to suppress all error messages, period, but that's not really ideal. I know I could also put everything inside a try-catch but that's not really ideal either. Is there anything mor...

Wamp server localhost error

stackoverflow.com - 2012-06-02 08:37:39 - Similar - Report/Block

all my services of wamp server are running but when I open my localhost it gives me this error "HTTP Error 403.14 - Forbidden The Web server is configured to not list the contents of this directory."...

wamp django apache error

stackoverflow.com - 2012-03-28 02:46:29 - Similar - Report/Block

I am trying to setup django python on wamp ( the latest). With all configurations done I get a 500 internal error. When I check my error logs I see that there is a syntax error and I compare with what I find from google and its the same. I have copied it here so please tell me what the problem is please. For background I am using Windows...

PHP Wamp doesn't run

stackoverflow.com - 2012-05-12 17:42:47 - Similar - Report/Block

I am trying to run WAMP under my XP. I installed it to C:/wamp, than copied old php files for example like test.php to the www folder in wamp folder, than run it throungh browser from adress file:///C:/wamp/www/test.php. It includes < ?echo("a");? > but it still run like html without running code and showing php in source code. What am...

Error code is 17 (when installing xp)

techguy.org - 2012-11-08 09:58:56 - Similar - Report/Block

error code is 17 (when installing xp) "System Setup Log - (C:\WINDOWS\setuperr.log) Error: The D:\I386\NT5.CAT catalog file could not be found. The error code is 17. This is a fatal error. Data error (cyclic redundancy check). xxx Error: The signature for Windows XP Home Edition Setup is invalid. The error code is 17. Data error (cyclic...

Fatal error: Can't use function return value in write context in

stackoverflow.com - 2012-05-16 12:10:22 - Similar - Report/Block

Ok, I'm trying to clean my code from injections, etc,etc. and I'm getting this fatal error: Fatal error: Can't use function return value in write context in.... Here's the line where it throws the error: $val=mysql_real_escape_string($val)=$_SE SSION['val']=strip_tags($_POST['val']); Why is it throwing this error? UPDATE: ok, thanks for th...

Subject: Fatal Error in K2HelperHTML - by: Kevin Struck

getk2.org - 2013-03-05 23:31:38 - Similar - Report/Block

Out of the blue, I am getting this error when I try to access my site. I did not make changes except add one category to the StackIdeas EasyDiscuss component. Fatal error: Call to undefined method K2HelperHTML::loadjQuery() in /homesite/public_html/plugins/system/k2/ k2.php on line 47 Any idea what this could be?...

Subject: Fatal Error: K2 - by: Superkoala

getk2.org - 2013-02-22 12:53:03 - Similar - Report/Block

After restore my website it is not runing. Fatal error: Class 'K2Model' not found in /var/www/clients/client602/web1221/web/p lugins/system/k2/k2.php on line 411 I have also on the mainpage after the update a problem with my slider Alex...

All RestKit projects fail to build when archiving

stackoverflow.com - 2011-11-28 23:27:31 - Similar - Report/Block

I recently inherited a project that uses restkit restkit.org ). I have started using a branch ( 402-new-build-process ) that is more compatible with xcode4.2 My project an all the example projects build and run, but when it comes to Archiving an app the build fails: /Users/AUser/Documents/SubFolder/stable- branches/project-iOS-client/RestK...

evolveStar Join

PHP Fatal Error on a native php function. Why?

stackoverflow.com - 2012-03-15 17:31:10 - Similar - Report/Block

(Update) Problem was due to my php version not being the minimum version specified in the The situation: Getting a fatal error on a native php function. ( Using php version 5.2.17 ) Any obvious reasons why? Error Output: PHP Fatal error: Call to undefined function gc_collect_cycles() in /home/oursite/public_html/pdfgenerator/m emory.php on...

Fatal error c0000034

techguy.org - 2013-05-22 05:44:41 - Similar - Report/Block

]Hi i have a dell inspiron with windows7 and it got shut down during an update now it wont boot windows it says Fatal Error C0000034 and i have no recovery disk or resore points. what can i do to fix it>...

how to stop iis server and start wamp server

eggheadcafe.com - 2013-04-10 14:19:06 - Similar - Report/Block

i am using windows 8 in my laoptop. i have install sql server and wamp server. when i give localhost in address- bar of internet i found iis server only. how can i get wamp server read more...

Subject: Items Won't Show, Keep Getting Fatal Error - by: Keith Feltman

getk2.org - 2013-02-28 16:00:53 - Similar - Report/Block

Developing a catalog on my web site using K2 and cannot get the items to show. I keep getting this text instead: Fatal error: Call to undefined function mb_internal_encoding() in /var/www/vhosts_roots/sfsjoomla/componen ts/com_k2/helpers/route.php on line 67 Fatal error: Class 'JFactory' not found in /var/www/vhosts_roots/sfsjoomla/librari. ..

Subject: Fatal error.. - by: Klaus

getk2.org - 2013-05-28 06:58:22 - Similar - Report/Block

Hi, Anyone know about this problem? Fatal error: Call to a member function countItemComments() on a non-object in /home/klaus/domains/motards.be/public_ht ml/modules/mod_k2_content/helper.php on line 369 Thanks...

Xdebug not working with PHP 5.5.0 beta1 on Windows

stackoverflow.com - 2013-03-22 17:22:14 - Similar - Report/Block

I've installed the latest php 5.5.0 beta1 on Windows x64 with Apache 2.4 (TS). I cannot get Xdebug to work though. I'm wondering if anyone knows if Xdebug is simply not supported with the new php beta yet or if I'm doing it wrong. I've spent the last hour trying every known issue on the net. Environment Apache Version Apache/2.4.4 (Win6...

Zend Framework: Intialize session (Database) error

stackoverflow.com - 2012-04-17 21:45:52 - Similar - Report/Block

Fatal error: Uncaught exception 'Zend_Db_Table_Exception' with message 'No adapter found for Zend_Session_SaveHandler_DbTable' in C:\wamp\www\hol\library\Zend\Db\Table\Ab stract.php on line 755 ( ! ) Zend_Db_Table_Exception: No adapter found for Zend_Session_SaveHandler_DbTable in C:\wamp\www\hol\library\Zend\Db\Table\Ab stract.php on...

Subject: Fatal error: K2HelperHTML not found in home - by: Ronald Paape

getk2.org - 2013-06-06 11:06:21 - Similar - Report/Block

Dear, I installed Joomla 3.1.1 and its a new installation. So I don''t have any items or whatever. After the Joomla install and a Template called EPIC from Joomlashine I installed K2 version 2.6.6. But I keep getting the next error: Fatal error: Class 'K2HelperHTML' not found in home/rpfacts/public_html/weddebruyn/plug ins/system/k2/k2.php...

How to use finadAndModify in php and mongodb

stackoverflow.com - 2012-03-22 08:27:15 - Similar - Report/Block

I want to increment id by 1 but I there is a problem while running the php page The Error is Fatal error: Call to undefined method MongoCollection::findAndModify() in C:\wamp\www\.... My Code is: <?php // connect $m = new Mongo(); $db=$m->demo;//selecting database named demo $db->authenticate("abc","abc");//auth enticate dat...

Subject: Fatal error with k2 and jotcache - by: Alvin Konda

getk2.org - 2013-05-15 16:55:15 - Similar - Report/Block

Hi guys, Im trying to use the latest jotchache on our joomla 2.5 website and i have enabled the latest k2 as well 2.6.6 but it gives me an error Fatal error: Class 'K2HelperHTML' not found in /home/icetheme/public_html/plugins/syste m/k2/k2.php on line 55 I have attached for you the k2.php file so that you can easily check. docs.google.com...

Comment on Fatal error undefined function wpsc_cart_item_count by Exotica

tokokoo.com - 2013-03-07 07:34:00 - Similar - Report/Block

Can we use Balita theme with woocommerce? I have installed woo commerce and happy with it see http://www.exoticashoppe.com But the theme is not upto the mark I want to change it with Balita.But I am getting same error Shopping Cart Fatal error: Call to undefined function wpsc_cart_item_count()...

iPhone app hpple HTML Parsing fatal error: 'libxml/tree.h' file not found [2]?

stackoverflow.com - 2012-06-02 13:44:35 - Similar - Report/Block

I am trying to parse HTML URL content using hpple for iPhone app. I want to parse and get data from like this URL http://www.example.com/mobile/403.html . I have used Google and found hpple for HTML parsing . I got the sample HTML parsing hpple code from github . When i start to run the project the below error is occurring 'libxml/tree.h'...

Subject: Fatal Error: K2 - by: Gerald

getk2.org - 2013-02-22 06:26:29 - Similar - Report/Block

Please HELP getting the following error when I click [Write for Us] link on my site: accbattles.com/coeds/writer-application. html Fatal error: Call to a member function getUserProfile() on a non-object in /home/accbattl/public_html/components/co m_k2/helpers/utilities.php on line 65 Not a coder but was able to comment out line 65 in the u...

Subject: Fatal Error: K2 - by: pepperstreet

getk2.org - 2013-03-20 12:06:14 - Similar - Report/Block

Superkoala wrote: ... Fatal error: Class 'K2Model' not found in /var/www/clients/client602/web1221/web/p lugins/system/k2/k2.php on line 411 ... I have also on the mainpage after the update a problem with my slider ... Please, check your servers PHP version. Running PHP 5.3+ could solve your issue.

Your project contains error(s), please fix it before running it

stackoverflow.com - 2011-02-10 08:06:57 - Similar - Report/Block

I am developing simple android application. But when I run eclipse tell me the error:Your project contains error(s), please fix it before running it. I can't find any error in my project or there is not have error in my application. There have red cross under the application name but it's no under the another file name. Does some guys mee...

RMAN Error ( 00601, 03004)

stackoverflow.com - 2012-05-09 09:09:48 - Similar - Report/Block

Please help on this RMAN error: RMAN> backup database plus archivelog; Starting backup at 08-MAY-12 current log archived allocated channel: ORA_DISK_1 channel ORA_DISK_1: sid=297 devtype=DISK RMAN-00571: ======================================== = RMAN-00569: =============== ERROR MESSAGE STACK FOLLO RMAN-00571: =========================...

reportTestCaseResult() gives testlink.api.java.client.TestLinkAPIException

stackoverflow.com - 2013-02-28 12:15:44 - Similar - Report/Block

I am trying to integrate selenium with Testlink test management tool, I have successfully installed testlink in my local machine using wampserver. Please refer to selenium script which i wrote in following google docs link: https://docs.google.com/document/d/1jyUB qJ9cx5496GiCTC5ktuXSXAYfhHmr7HLr6liTpbQ/ edit When i run the script using Tes...

[SOLVED] Parse error PHP

codecall.net - 2013-02-05 14:39:34 - Similar - Report/Block

Hi, I have written the code below, it gives this error Parse error: syntax error, unexpected end of file in C:\wamp\www\smarty\manswer.php on line Line 18 is the the last line. Can you tell me where the problem is please? Thanks.

‘Fatal Frame 2′ Haunts PSN Next Week

bloody-disgusting.com - 2013-05-03 22:45:25 - Similar - Report/Block

DreadOut doesn’t satiate your appetite for hunting down those pesky ghosts with a camera than you’re more than welcome to re-experience the horrifying game that was Fatal Frame II: Crimson Butterfly when it releases on PSN next Tuesday. This was, in my humble opinion, the best game in the series, so I’m crazy excited to get my hands o...

My WAMP server can only handle request from localhost

stackoverflow.com - 2012-07-20 05:11:15 - Similar - Report/Block

My WAMP server is installed in a virtual machine, and I have developed a simple PHP file and an android file. The android file should be correct and able to send out the HTML request, however the server side PHP program never respond to the request. Therefore I made a simple site in the server and tried to browse it in another desktop, it...

Sudden error: Fatal error: Class 'vBulletinHook' not found

vbadvanced.com - 2012-07-31 21:26:29 - Similar - Report/Block

Hello, I've been using VBA Dynamics for a long time now and haven't updated it or VB in a long time. Suddenly, I tried to access it the other day and this error message comes up: Fatal error: Class 'vBulletinHook' not found in /home/square/public_html/fan-arrangement s/dyna_global.php on line 41 Nothing has been done to my server, so I hav...

Class not found on server , workes well on local

stackoverflow.com - 2013-04-11 14:18:34 - Similar - Report/Block

I am using symfony2.1 ,github and capfony(for deployment) When I start the project these combination works very well. However,Since I added SonataUserBundle and FOSUserbundle to project cap deploy command returns error such as PHP Fatal error: Class 'Sonata\AdminBundle\SonataAdminBundle' not found in /var/www/html/muty/releases/2013041014.. .

T-SQL find an eight character string which contains no spaces and at least 1 number from within a string and exclude it

stackoverflow.com - 2012-03-14 10:54:33 - Similar - Report/Block

The problem is we have many different error messages being produced and stored in a sql table within the error message there could be an occurance of a project number 8 characters long which would contain at least 1 number is alphanumeric and no spaces. per error message the project number may not be the same. 'error found processing proj...

fatal error LNK1120: ? как исправить? - С++ для начинающих

cyberforum.ru - 2012-10-02 09:53:24 - Similar - Report/Block

project in visual studio 2012 .. и при компиляции ругается. помогите разобратся.... 1>------ Build started: Project: npcodeproject, Configuration: Release Win32 ------ 1>nprt.def : error LNK2001: unresolved external symbol NP_GetEntryPoints 1>C:\Program Files\Mozilla Firefox\plugins\NPCODEPROJECT.lib : fatal error LNK1120: 1 unre...

Ошибка при компилировании проекта. [Linker Fatal Error] Fatal: Unable to open file '*.OBJ' - C++ Builder

cyberforum.ru - 2013-06-03 22:25:14 - Similar - Report/Block

Ребят, при компилировании проекта вылезает ошибка [Linker Fatal Error] Fatal: Unable to open file 'ACPNG.OBJ' P.S. исходник проекта был куплен, а продавец сразу же удалился со скайпа. :( Что делать? Добавлено через 11 минут Перерыл весь гугл и яндекс, ничего похожего не нашел. Спасите хоть вы. На вас вся надежда. :)...

hilfe bei Fatal error: Class 'Archive_Zip'

php.de - 2013-03-15 07:55:54 - Similar - Report/Block

Guten Morgen, hoffe jemand kann mir mal gerade weiter helfen? bekomme immer folgenden Error: Fatal error: Class 'Archive_Zip' not found in ... line 382 PHP-Code: include_once( 'importer_Zip.php' $zippath "iconz/favicon_" $unique ".zip" $zip = new Archive_Zip $zippath $zip create "tmp/ico" , array( 'remove_path' "tmp/ico/" )); ich nutzte P...

Fatal Error im Backend nach deaktivieren eines Plugins

joomlaportal.de - 2013-05-28 10:50:05 - Similar - Report/Block

Hallo zusammen, ich habe aus versehen ein Plugin deaktiviert (Joomess). Nach dem das deaktiviert wurde hat es im Backend sofort ein fatal error angezeigt. wenn ich jetzt versuche mich im backend anzumelden kommt sofort folgende fehlermeldung: Fatal error: Class 'JFile' not found in /mnt/web2/d2/95/52250595/htdocs/ffw/admi nistrator/modules...

Как собрать edb? - Ubuntu, Mint Linux

cyberforum.ru - 2013-05-08 18:39:07 - Similar - Report/Block

скачал edb, qmake прошел на ура, а вот make выдает какие-то ошибки... видимо что-то с boost'ом связано, но как решить хз... Код: fatal-error@ProgrammerPC ~/debugger $ make cd src/ && /usr/bin/qmake /home/fatal-error/debugger/src/src.pro -o Makefile cd src/ && make -f Makefile make[1]: Entering directory `/home/fatal-error/debugger/src' /u...




dialogShowMessage!

Fill out the form you see below. Registration is free, fast and simple.
If you are already registered, sign in page login.


Web Site :
Required Field
First Name :
Required Field
Last Name :
Required Field
Email :
Required Field
Sex :
Required Field

evolveStar.com is free for ever !


evolveStar.com provides a search engine that allows you to gather information to write their own blog.


evolveStar.com enhances the sources displaying the logo of the site.


If you want to remove your site or you believe a site listed infringes copyright, please report it to: info@evolvestar.com


Specifies the subject copyright violation and the url of the page


evolveStar.com respecting the law DMCA (Digital Millennium Copyright Act) will immediately remove whatever its merits.


Next will be effectual and relevant checks.







Who We Are Partner Advertising Contacts Privacy terms Help & FAQ

© Copyright 2010-2017 Fabrizio Fichera. All rights reserved.