EnumProcesses linker error in Dev-C++

stackoverflow.com - 2012-03-22 08:40:12 - Similar - Report/Block

I am getting a linker error " [Linker error] undefined reference to 'EnumProcesses@12' " IDE : Dev-C++ 4.9 OS : Windows 7 Ultimate 64-bit I know that GCC does not support #pragma comment(lib, "psapi.lib") But in Dev-C++ we can add commands to the linker command line (Tools > Compiler Options). So, I would like to have a linker command l...

Suppress user-visible PHP error messages but not error log messages

stackoverflow.com - 2012-03-15 17:53:05 - Similar - Report/Block

I'd like for PHP to still send it's minor and fatal errors to the error log but not display it to the user. I thought at first I could use error_reporting(0); to suppress all error messages, period, but that's not really ideal. I know I could also put everything inside a try-catch but that's not really ideal either. Is there anything mor...

iOS xcode Apple-MachO linker error

stackoverflow.com - 2013-02-28 08:21:37 - Similar - Report/Block

i am getting this error when i am compiling program in xcode. I am just a learner so let me know what actually error is..thanks in advance Undefined symbols for architecture i386: "_OBJC_CLASS_$_MyDatabase", referenced from: objc-class-ref in Gallery_CollectionViewController.o ld: symbol(s) not found for architecture i386 clang: error:...

Error code is 17 (when installing xp)

techguy.org - 2012-11-08 09:58:56 - Similar - Report/Block

error code is 17 (when installing xp) "System Setup Log - (C:\WINDOWS\setuperr.log) Error: The D:\I386\NT5.CAT catalog file could not be found. The error code is 17. This is a fatal error. Data error (cyclic redundancy check). xxx Error: The signature for Windows XP Home Edition Setup is invalid. The error code is 17. Data error (cyclic...

Fatal error: Can't use function return value in write context in

stackoverflow.com - 2012-05-16 12:10:22 - Similar - Report/Block

Ok, I'm trying to clean my code from injections, etc,etc. and I'm getting this fatal error: Fatal error: Can't use function return value in write context in.... Here's the line where it throws the error: $val=mysql_real_escape_string($val)=$_SE SSION['val']=strip_tags($_POST['val']); Why is it throwing this error? UPDATE: ok, thanks for th...

Problema al rootear Backflip

grupoandroid.com - 2013-04-10 20:47:36 - Similar - Report/Block

Hola gente, soy nuevo en el foro, pero vengo leyendo hace unas semanas. Miren, en realidad no hubiera querido tener que consultar para no tener que molestar ya que es un celu un poco viejo y un tema dejado medio atras (creo yo), pero ya no me queda otra, ya no se que hacer. Tengo un Motorola Backflip, este está en su versión 1.5 todavia.

Subject: Fatal Error in K2HelperHTML - by: Kevin Struck

getk2.org - 2013-03-05 23:31:38 - Similar - Report/Block

Out of the blue, I am getting this error when I try to access my site. I did not make changes except add one category to the StackIdeas EasyDiscuss component. Fatal error: Call to undefined method K2HelperHTML::loadjQuery() in /homesite/public_html/plugins/system/k2/ k2.php on line 47 Any idea what this could be?...

Subject: Fatal Error: K2 - by: Superkoala

getk2.org - 2013-02-22 12:53:03 - Similar - Report/Block

After restore my website it is not runing. Fatal error: Class 'K2Model' not found in /var/www/clients/client602/web1221/web/p lugins/system/k2/k2.php on line 411 I have also on the mainpage after the update a problem with my slider Alex...

Linker error when unit testing: ld: illegal text-relocation to cstring in ... from _av_image_check_size in .../libavutil.a(imgutils.o)

stackoverflow.com - 2012-07-03 21:15:31 - Similar - Report/Block

In Xcode 4.3.2, building an iPad app, which includes libavutil.a from the ffmpeg distribution, it builds and runs correctly but when I try to run unit tests (Cmd-U) I get the following linker error: ld: illegal text-relocation to cstring in /myPath/libavutil.a(imgutils.o) from _av_image_check_size in /myPath/libavutil.a(imgutils.o) for ar...

PHP Fatal Error on a native php function. Why?

stackoverflow.com - 2012-03-15 17:31:10 - Similar - Report/Block

(Update) Problem was due to my php version not being the minimum version specified in the The situation: Getting a fatal error on a native php function. ( Using php version 5.2.17 ) Any obvious reasons why? Error Output: PHP Fatal error: Call to undefined function gc_collect_cycles() in /home/oursite/public_html/pdfgenerator/m emory.php on...

Fatal error c0000034

techguy.org - 2013-05-22 05:44:41 - Similar - Report/Block

]Hi i have a dell inspiron with windows7 and it got shut down during an update now it wont boot windows it says Fatal Error C0000034 and i have no recovery disk or resore points. what can i do to fix it>...

Subject: Items Won't Show, Keep Getting Fatal Error - by: Keith Feltman

getk2.org - 2013-02-28 16:00:53 - Similar - Report/Block

Developing a catalog on my web site using K2 and cannot get the items to show. I keep getting this text instead: Fatal error: Call to undefined function mb_internal_encoding() in /var/www/vhosts_roots/sfsjoomla/componen ts/com_k2/helpers/route.php on line 67 Fatal error: Class 'JFactory' not found in /var/www/vhosts_roots/sfsjoomla/librari. ..

evolveStar Join

Subject: Fatal error.. - by: Klaus

getk2.org - 2013-05-28 06:58:22 - Similar - Report/Block

Hi, Anyone know about this problem? Fatal error: Call to a member function countItemComments() on a non-object in /home/klaus/domains/motards.be/public_ht ml/modules/mod_k2_content/helper.php on line 369 Thanks...

Calling an external class in iOS

stackoverflow.com - 2012-07-20 05:12:56 - Similar - Report/Block

I have this class for button which was added to my project workspace. I had linker error ( Apple Mach-o Linker Error) Then again i opened a new project and added this class. I had *unrecognized selector sent to instance error This is the class I suggest you use the Glow Category of UIView made by secret lab Any suggestion on how to cal...

Subject: Error: Class 'K2Table' not found in k2user.php - by: MaTsch

getk2.org - 2012-10-16 19:57:04 - Similar - Report/Block

Hi guys! I searched for help in the forum, but didn't find a solution yet... I use Joomla v2.5.7 (with Community Builder v1.8.1). I upgraded K2 from v2.5.7 to v2.6.1 and all my registered visitors got that fatal error ("Fatal error: Class 'K2Table' not found in xxx/administrator/components/com_k2/tabl es/k2user.php on line 13"). If I clear...

FMDB : Linker command failed with exit code 1

stackoverflow.com - 2012-05-20 11:30:36 - Similar - Report/Block

I try to use FMDB Database but I've got an error : Undefined symbols for architecture i386: "_OBJC_CLASS_$_FMDatabase", referenced from: objc-class-ref in MainViewAppDelegate.o ld: symbol(s) not found for architecture i386 clang: error: linker command failed with exit code 1 (use -v to see invocation) I've added the src directory except...

Subject: Fatal error: K2HelperHTML not found in home - by: Ronald Paape

getk2.org - 2013-06-06 11:06:21 - Similar - Report/Block

Dear, I installed Joomla 3.1.1 and its a new installation. So I don''t have any items or whatever. After the Joomla install and a Template called EPIC from Joomlashine I installed K2 version 2.6.6. But I keep getting the next error: Fatal error: Class 'K2HelperHTML' not found in home/rpfacts/public_html/weddebruyn/plug ins/system/k2/k2.php...

Subject: Fatal error with k2 and jotcache - by: Alvin Konda

getk2.org - 2013-05-15 16:55:15 - Similar - Report/Block

Hi guys, Im trying to use the latest jotchache on our joomla 2.5 website and i have enabled the latest k2 as well 2.6.6 but it gives me an error Fatal error: Class 'K2HelperHTML' not found in /home/icetheme/public_html/plugins/syste m/k2/k2.php on line 55 I have attached for you the k2.php file so that you can easily check. docs.google.com...

Comment on Fatal error undefined function wpsc_cart_item_count by Exotica

tokokoo.com - 2013-03-07 07:34:00 - Similar - Report/Block

Can we use Balita theme with woocommerce? I have installed woo commerce and happy with it see http://www.exoticashoppe.com But the theme is not upto the mark I want to change it with Balita.But I am getting same error Shopping Cart Fatal error: Call to undefined function wpsc_cart_item_count()...

Subject: Fatal Error: K2 - by: Gerald

getk2.org - 2013-02-22 06:26:29 - Similar - Report/Block

Please HELP getting the following error when I click [Write for Us] link on my site: accbattles.com/coeds/writer-application. html Fatal error: Call to a member function getUserProfile() on a non-object in /home/accbattl/public_html/components/co m_k2/helpers/utilities.php on line 65 Not a coder but was able to comment out line 65 in the u...

Subject: Fatal Error: K2 - by: pepperstreet

getk2.org - 2013-03-20 12:06:14 - Similar - Report/Block

Superkoala wrote: ... Fatal error: Class 'K2Model' not found in /var/www/clients/client602/web1221/web/p lugins/system/k2/k2.php on line 411 ... I have also on the mainpage after the update a problem with my slider ... Please, check your servers PHP version. Running PHP 5.3+ could solve your issue.

RMAN Error ( 00601, 03004)

stackoverflow.com - 2012-05-09 09:09:48 - Similar - Report/Block

Please help on this RMAN error: RMAN> backup database plus archivelog; Starting backup at 08-MAY-12 current log archived allocated channel: ORA_DISK_1 channel ORA_DISK_1: sid=297 devtype=DISK RMAN-00571: ======================================== = RMAN-00569: =============== ERROR MESSAGE STACK FOLLO RMAN-00571: =========================...

reportTestCaseResult() gives testlink.api.java.client.TestLinkAPIException

stackoverflow.com - 2013-02-28 12:15:44 - Similar - Report/Block

I am trying to integrate selenium with Testlink test management tool, I have successfully installed testlink in my local machine using wampserver. Please refer to selenium script which i wrote in following google docs link: https://docs.google.com/document/d/1jyUB qJ9cx5496GiCTC5ktuXSXAYfhHmr7HLr6liTpbQ/ edit When i run the script using Tes...

‘Fatal Frame 2′ Haunts PSN Next Week

bloody-disgusting.com - 2013-05-03 22:45:25 - Similar - Report/Block

DreadOut doesn’t satiate your appetite for hunting down those pesky ghosts with a camera than you’re more than welcome to re-experience the horrifying game that was Fatal Frame II: Crimson Butterfly when it releases on PSN next Tuesday. This was, in my humble opinion, the best game in the series, so I’m crazy excited to get my hands o...

Sudden error: Fatal error: Class 'vBulletinHook' not found

vbadvanced.com - 2012-07-31 21:26:29 - Similar - Report/Block

Hello, I've been using VBA Dynamics for a long time now and haven't updated it or VB in a long time. Suddenly, I tried to access it the other day and this error message comes up: Fatal error: Class 'vBulletinHook' not found in /home/square/public_html/fan-arrangement s/dyna_global.php on line 41 Nothing has been done to my server, so I hav...

PHP: catching a fatal error (call to member function on a non-object)

stackoverflow.com - 2012-07-15 05:48:07 - Similar - Report/Block

Sometimes, my script cannot read output by a server and the following error occurs: PHP Fatal error: Call to a member function somefun() on a non-object This is not something that can't be fixed on my end but this causes my script to crash. Is there a way I can create a function that gets run when this particular error occurs? I don't thi...

Blue Screen Fatal Error

sevenforums.com - 2013-03-25 16:46:46 - Similar - Report/Block

Windows 7. My electric went off during configurations & I have ended up, after trying to follow the instructions to fix it, with a blue screen with Stop: c000021a fatal error, computer shut down, the verification of a knownDLL failed system process terminated unexpectedly with a status of 0x000012f (0x003aa170 0x00000000 ) the system has...

Error:Missing Framework

stackoverflow.com - 2013-03-18 10:41:04 - Similar - Report/Block

I have created my own framework which has Tabbars.While Implementing on another program it gives Error as Follows: ld: framework not found OwnTabFramework clang: error: linker command failed with exit code 1 (use -v to see invocation) I'm struggling for 2 days.Can anyBody help me findout where i've done wrong.or how to solve this kind of...

unresolved external symbol compile error

stackoverflow.com - 2012-04-21 07:25:11 - Similar - Report/Block

I frequently have this problem when I try a new library. This time I work with PointGrey Camera and try to use its API libraries (some dll, lib, header files). Mostly, problems were fixed by configuring the SDK (I'm using VS2008) Tools/Options/VC++ Directories/include files(/library files)(/executable files), I also tried with project con...

Strange invalid characters error while pushing changes to remote branch

stackoverflow.com - 2012-04-05 05:25:28 - Similar - Report/Block

I am using windows machine to push changes in a java file i changed in eclipse. i am successfully able to commit the changes but when i try to push these changes to remote branch it throws the following error fatal: invalid characters in /tuscany/jupiter fatal: The remote end hung up unexpectedly I tried pushing changes via TortoiseGo...

Wordpress Fatal error: add_rewrite_tag()

stackoverflow.com - 2012-01-26 11:37:00 - Similar - Report/Block

I am using the following code to pull in posts to a page outside of wordpress(3.3.1): require_once './blog/wp-load.php'; query_posts('numberposts=3'); When the permalinks are set to default the code works fine and the posts display. When I set the permalinks to anything other than default I get the following error: Fatal error: Call to a...

Why /MD is compiler's option? not linker's? [closed]

stackoverflow.com - 2012-03-15 20:05:56 - Similar - Report/Block

Possible Duplicate: Why is runtime library a compiler option rather than a linker option? I do not understand clearly why i have to choose type of RTL at the compiling stage? For example i have created one static library A.lib with option /MD. Then i've created second static library B.lib with option /MT. When i try to link A.lib and B.li...

SDL strange linker error in MVS

stackoverflow.com - 2012-07-14 10:57:38 - Similar - Report/Block

I'm stumped trying to link the SDL libraries against a new C++ Win32 Console application in MVS 2010. I downloaded the latest SDL development libraries, and did the usual steps: Added the includes to the include path ( ) [This works fine, as MVS finds the #include files] Added the library path for SDL ( ) [This seems to work fine, as remo...

Ошибка при компилировании проекта. [Linker Fatal Error] Fatal: Unable to open file '*.OBJ' - C++ Builder

cyberforum.ru - 2013-06-03 22:25:14 - Similar - Report/Block

Ребят, при компилировании проекта вылезает ошибка [Linker Fatal Error] Fatal: Unable to open file 'ACPNG.OBJ' P.S. исходник проекта был куплен, а продавец сразу же удалился со скайпа. :( Что делать? Добавлено через 11 минут Перерыл весь гугл и яндекс, ничего похожего не нашел. Спасите хоть вы. На вас вся надежда. :)...

Fatal Error: Call to undefined....

joomlaportal.de - 2013-03-04 10:55:53 - Similar - Report/Block

Beim Aufrufen von Beiträgen im Backend taucht folgende Fehlermeldung auf: Fatal error: Call to undefined method ContentController::viewContent() in /var/www/virtual/garten-wildenauer.de/ht docs/administrator/components/com_conten t/admin.content.php on line 131 Was Tun? Vielen Dank bereits im Voraus!...

hilfe bei Fatal error: Class 'Archive_Zip'

php.de - 2013-03-15 07:55:54 - Similar - Report/Block

Guten Morgen, hoffe jemand kann mir mal gerade weiter helfen? bekomme immer folgenden Error: Fatal error: Class 'Archive_Zip' not found in ... line 382 PHP-Code: include_once( 'importer_Zip.php' $zippath "iconz/favicon_" $unique ".zip" $zip = new Archive_Zip $zippath $zip create "tmp/ico" , array( 'remove_path' "tmp/ico/" )); ich nutzte P...

Fatal Error im Backend nach deaktivieren eines Plugins

joomlaportal.de - 2013-05-28 10:50:05 - Similar - Report/Block

Hallo zusammen, ich habe aus versehen ein Plugin deaktiviert (Joomess). Nach dem das deaktiviert wurde hat es im Backend sofort ein fatal error angezeigt. wenn ich jetzt versuche mich im backend anzumelden kommt sofort folgende fehlermeldung: Fatal error: Class 'JFile' not found in /mnt/web2/d2/95/52250595/htdocs/ffw/admi nistrator/modules...

Как собрать edb? - Ubuntu, Mint Linux

cyberforum.ru - 2013-05-08 18:39:07 - Similar - Report/Block

скачал edb, qmake прошел на ура, а вот make выдает какие-то ошибки... видимо что-то с boost'ом связано, но как решить хз... Код: fatal-error@ProgrammerPC ~/debugger $ make cd src/ && /usr/bin/qmake /home/fatal-error/debugger/src/src.pro -o Makefile cd src/ && make -f Makefile make[1]: Entering directory `/home/fatal-error/debugger/src' /u...

Линковка библиотек DirectX SDK - С++ для начинающих

cyberforum.ru - 2012-10-12 11:55:02 - Similar - Report/Block

Добрый день, знатоки. У меня проблема с линковкой, поиск юзал, но советы из других тем не помогли. В общем, установил я Microsoft DirectX SDK (June 2010), запустил в VS2010 самый простейший прилагающийся к sdk проект-пример CreateDevice. Не трогаю ничего, жму F7 и получаю ошибку LINK : fatal error LNK1104: cannot open file 'd3dx10d.lib'...

fatal error LNK1120: ? как исправить? - С++ для начинающих

cyberforum.ru - 2012-10-02 09:53:24 - Similar - Report/Block

project in visual studio 2012 .. и при компиляции ругается. помогите разобратся.... 1>------ Build started: Project: npcodeproject, Configuration: Release Win32 ------ 1>nprt.def : error LNK2001: unresolved external symbol NP_GetEntryPoints 1>C:\Program Files\Mozilla Firefox\plugins\NPCODEPROJECT.lib : fatal error LNK1120: 1 unre...


Fill out the form you see below. Registration is free, fast and simple.
If you are already registered, sign in page login.

Web Site :
Required Field
First Name :
Required Field
Last Name :
Required Field
Email :
Required Field
Sex :
Required Field

evolveStar.com is free for ever !

evolveStar.com provides a search engine that allows you to gather information to write their own blog.

evolveStar.com enhances the sources displaying the logo of the site.

If you want to remove your site or you believe a site listed infringes copyright, please report it to: info@evolvestar.com

Specifies the subject copyright violation and the url of the page

evolveStar.com respecting the law DMCA (Digital Millennium Copyright Act) will immediately remove whatever its merits.

Next will be effectual and relevant checks.

Who We Are Partner Advertising Contacts Privacy terms Help & FAQ

© Copyright 2010-2017 Fabrizio Fichera. All rights reserved.